Target
Voltage-dependent L-type calcium channel subunit alpha-1C
Ligand
BDBM50013023
Substrate
Meas. Tech.
ChEBML_42766
Ki
417±n/a nM
Citation
 Natale, NRTriggle, DJPalmer, RBLefler, BJEdwards, WD 4-Isoxazolyl-1,4-dihydropyridines: biological, theoretical, and structural studies. J Med Chem 33:2255-9 (1990)  
Target
Name:
Voltage-dependent L-type calcium channel subunit alpha-1C
Synonyms:
CAC1C_HUMAN CACN2 CACNL1A1 Calcium channel (Type L) L-type calcium channel alpha-1c/beta-2/alpha2delta-1 Voltage-gated L-type calcium channel Voltage-gated calcium channel | Voltage-gated calcium channel subunit alpha Cav1.2
Type:
Enzyme Catalytic Domain
Mol. Mass.:
248979.79
Organism:
Homo sapiens (Human)
Description:
Calcium channel (Type L) 0 HUMAN::Q13936
Residue:
2221
  
Inhibitor
Name:
BDBM50013023
Synonyms:
4-(5-Isopropyl-3-phenyl-isoxazol-4-yl)-2,6-dimethyl-1,4-dihydro-pyridine-3,5-dicarboxylic acid diethyl ester | CHEMBL75770
Type:
Small organic molecule
Emp. Form.:
C25H30N2O5
Mol. Mass.:
438.5161
SMILES:
CCOC(=O)C1C(c2c(onc2-c2ccccc2)C(C)C)C(C(=O)OCC)=C(C)N=C1C
: