Target
Muscarinic acetylcholine receptor M5
Ligand
BDBM50385677
Substrate
Meas. Tech.
ChEMBL_1709499 (CHEMBL4119548)
Ki
1.8±n/a nM
Citation
 Del Bello, FBonifazi, AGiorgioni, GPetrelli, RQuaglia, WAltomare, AFalcicchio, AMatucci, RVistoli, GPiergentili, A Novel muscarinic acetylcholine receptor hybrid ligands embedding quinuclidine and 1,4-dioxane fragments. Eur J Med Chem 137:327-337 (2017)  
Target
Name:
Muscarinic acetylcholine receptor M5
Synonyms:
ACM5_HUMAN | CHRM5
Type:
PROTEIN
Mol. Mass.:
60102.35
Organism:
Homo sapiens (Human)
Description:
ChEMBL_1517990
Residue:
532
  
Inhibitor
Name:
BDBM50385677
Synonyms:
CHEMBL2042553
Type:
Small organic molecule
Emp. Form.:
C19H23NO2
Mol. Mass.:
297.3914
SMILES:
CN(C)C[C@H]1COCC(O1)(c1ccccc1)c1ccccc1
: