Target
Neuraminidase
Ligand
BDBM50271265
Substrate
Meas. Tech.
ChEMBL_1710934 (CHEMBL4120983)
IC50
32±n/a nM
Citation
 McKimm-Breschkin, JLBarrett, SPilling, PAHader, SWatts, AGStreltsov, VA Structural and Functional Analysis of Anti-Influenza Activity of 4-, 7-, 8- and 9-Deoxygenated 2,3-Difluoro- N-acetylneuraminic Acid Derivatives. J Med Chem 61:1921-1933 (2018)  
Target
Name:
Neuraminidase
Synonyms:
Influenza B Virus Neuraminidase NRAM_INBLE Neuraminidase B
Type:
Enzyme
Mol. Mass.:
51446.67
Organism:
Influenza B virus (B/Lee/40)
Description:
Residue:
466
  
Inhibitor
Name:
BDBM50271265
Synonyms:
CHEMBL4126987
Type:
Small organic molecule
Emp. Form.:
C11H17F2NO7
Mol. Mass.:
313.252
SMILES:
[H][C@]1(O[C@](F)([C@H](F)C[C@H]1NC(C)=O)C(O)=O)[C@H](O)[C@H](O)CO
: