Target
Vasopressin V1a receptor
Ligand
BDBM50044777
Substrate
Meas. Tech.
ChEMBL_1711188 (CHEMBL4121237)
Ki
2.0±n/a nM
Citation
 Beard, RStucki, ASchmitt, MPy, GGrundschober, CGee, ADTate, EW Building bridges for highly selective, potent and stable oxytocin and vasopressin analogs. Bioorg Med Chem 26:3039-3045 (2018)  
Target
Name:
Vasopressin V1a receptor
Synonyms:
AVPR V1a AVPR1A V1AR_HUMAN VASOPRESSIN V1A Vasopressin V1 receptor Vasopressin receptor
Type:
Receptor
Mol. Mass.:
46820.18
Organism:
Homo sapiens (Human)
Description:
P37288
Residue:
418
  
Inhibitor
Name:
BDBM50044777
Synonyms:
Arginine Vasopressin CHEBI:34543 Pitressin Vasopressin
Type:
Small organic molecule
Emp. Form.:
C46H65N15O12S2
Mol. Mass.:
1084.232
SMILES:
N[C@H]1CSSC[C@H](NC(=O)[C@H](CC(N)=O)NC(=O)[C@H](CCC(N)=O)NC(=O)[C@H](Cc2ccccc2)NC(=O)[C@H](Cc2ccc(O)cc2)NC1=O)C(=O)N1CCC[C@H]1C(=O)N[C@@H](CCCNC(N)=N)C(=O)NCC(N)=O
: