Target
Oxytocin receptor
Ligand
BDBM50271607
Substrate
Meas. Tech.
ChEMBL_1711194 (CHEMBL4121243)
EC50
>10000±n/a nM
Citation
 Beard, RStucki, ASchmitt, MPy, GGrundschober, CGee, ADTate, EW Building bridges for highly selective, potent and stable oxytocin and vasopressin analogs. Bioorg Med Chem 26:3039-3045 (2018)  
Target
Name:
Oxytocin receptor
Synonyms:
OT-R OXYR_HUMAN | Oxytocin
Type:
Enzyme Catalytic Domain
Mol. Mass.:
42793.26
Organism:
Homo sapiens (Human)
Description:
Oxytocin OXTR HEK293::B2R9L7
Residue:
389
  
Inhibitor
Name:
BDBM50271607
Synonyms:
CHEMBL4126100
Type:
Small organic molecule
Emp. Form.:
C51H74N14O12S2
Mol. Mass.:
1139.35
SMILES:
CC[C@H](C)[C@@H]1NC(=O)[C@H](Cc2ccc(O)cc2)NC(=O)CCSCc2ccccc2CSC[C@H](NC(=O)[C@H](CC(N)=O)NC(=O)[C@H](CCC(N)=O)NC1=O)C(=O)N1CCC[C@H]1C(=O)N[C@@H](CCCNC(N)=N)C(=O)NCC(N)=O
: