Target
Vasopressin V2 receptor
Ligand
BDBM50271609
Substrate
Meas. Tech.
ChEMBL_1711197 (CHEMBL4121246)
EC50
3669±n/a nM
Citation
 Beard, RStucki, ASchmitt, MPy, GGrundschober, CGee, ADTate, EW Building bridges for highly selective, potent and stable oxytocin and vasopressin analogs. Bioorg Med Chem 26:3039-3045 (2018)  
Target
Name:
Vasopressin V2 receptor
Synonyms:
ADHR AVPR2 DIR Renal-type arginine vasopressin receptor V2R_HUMAN Vasopressin V2 receptor | Vasopressin receptor
Type:
Receptor
Mol. Mass.:
40295.28
Organism:
Homo sapiens (Human)
Description:
P30518
Residue:
371
  
Inhibitor
Name:
BDBM50271609
Synonyms:
CHEMBL4128839
Type:
Small organic molecule
Emp. Form.:
C50H71N11O12S2
Mol. Mass.:
1082.295
SMILES:
CC[C@H](C)[C@@H]1NC(=O)[C@H](Cc2ccc(O)cc2)NC(=O)CCSCc2ccc(SC[C@H](NC(=O)[C@H](CC(N)=O)NC(=O)[C@H](CCC(N)=O)NC1=O)C(=O)N1CCC[C@H]1C(=O)N[C@@H](CC(C)C)C(=O)NCC(N)=O)cc2
: