Target
Nuclear receptor ROR-gamma
Ligand
BDBM392013
Substrate
Meas. Tech.
ChEMBL_1711300 (CHEMBL4121349)
IC50
0.690000±n/a nM
Citation
 Gege, CCummings, MDAlbers, MKinzel, OKleymann, GSchlüter, TSteeneck, CNelen, MIMilligan, CSpurlino, JXue, XLeonard, KEdwards, JPFourie, AGoldberg, SDHoffmann, T Identification and biological evaluation of thiazole-based inverse agonists of ROR?t. Bioorg Med Chem Lett 28:1446-1455 (2018)  
Target
Name:
Nuclear receptor ROR-gamma
Synonyms:
NR1F3 Nuclear receptor ROR-gamma (RORC) RAR-related orphan receptor C (RORc) RORG RZRG Retinoid-related orphan receptor-gamma (RORc)
Type:
Enzyme Catalytic Domain
Mol. Mass.:
58218.40
Organism:
Homo sapiens (Human)
Description:
P51449
Residue:
518
  
Inhibitor
Name:
BDBM392013
Synonyms:
US10301272, Example 6/11
Type:
Small organic molecule
Emp. Form.:
C30H39N3O4S2
Mol. Mass.:
569.778
SMILES:
CC(C)(C)NS(=O)(=O)c1ccc(-c2sc(nc2CC2CCCCC2)C(=O)NC2CCOCC2)c2ccccc12
: