Target
Extracellular calcium-sensing receptor
Ligand
BDBM50272605
Substrate
Meas. Tech.
ChEMBL_1712581 (CHEMBL4122630)
IC50
1.4±n/a nM
Citation
 Miyazaki, HIkeda, YSakurai, OMiyake, TTsubota, ROkabe, JKuroda, MHisada, YYanagida, TYoneda, HTsukumo, YTokunaga, SKawata, TOhashi, RFukuda, HKojima, KKannami, AKifuji, TSato, NIdei, AIguchi, TSakairi, TMoritani, Y Discovery of evocalcet, a next-generation calcium-sensing receptor agonist for the treatment of hyperparathyroidism. Bioorg Med Chem Lett 28:2055-2060 (2018)  
Target
Name:
Extracellular calcium-sensing receptor
Synonyms:
CASR_RAT Casr Parathyroid Cell calcium-sensing receptor | Pcar1
Type:
PROTEIN
Mol. Mass.:
120858.46
Organism:
Rattus norvegicus
Description:
ChEMBL_750426
Residue:
1079
  
Inhibitor
Name:
BDBM50272605
Synonyms:
CHEMBL4128542
Type:
Small organic molecule
Emp. Form.:
C24H27Cl2F3N2O
Mol. Mass.:
487.385
SMILES:
Cl.Cl.C[C@@H](N[C@@H]1CCCN(C1)c1cccc(OC(F)(F)F)c1)c1cccc2ccccc12
: