Target
Cysteinyl leukotriene receptor 1/2
Ligand
BDBM50228527
Substrate
Meas. Tech.
ChEMBL_52221 (CHEMBL663971)
Ki
8±n/a nM
Citation
 Galemmo, RAJohnson, WHLearn, KSLee, TDHuang, FCCampbell, HFYoussefyeh, RO'Rourke, SVSchuessler, GSweeney, DM The development of a novel series of (quinolin-2-ylmethoxy)phenyl-containing compounds as high-affinity leukotriene receptor antagonists. 3. Structural variation of the acidic side chain to give antagonists of enhanced potency. J Med Chem 33:2828-41 (1990)  
Target
Name:
Cysteinyl leukotriene receptor 1/2
Synonyms:
Cysteinyl leukotriene receptor
Type:
Mol. Mass.:
Description:
ASSAY_ID of ChEMBL is 98640
Components:
This complex has 2 components.
Component 1
Name:
Cysteinyl leukotriene receptor 1
Synonyms:
CLTR1_HUMAN CYSLTR1 Cysteinyl leukotriene receptor HG55 LTD4 receptor | Leukotriene Cysteinyl 1
Type:
Enzyme Catalytic Domain
Mol. Mass.:
38565.16
Organism:
Homo sapiens (Human)
Description:
Leukotriene Cysteinyl 1 CYSLTR1 HUMAN::Q9Y271
Residue:
337
  
Component 2
Name:
Cysteinyl leukotriene receptor 2
Synonyms:
CLTR2_HUMAN CYSLT2R Cysteinyl leukotriene receptor Leukotriene Cysteinyl 2
Type:
Enzyme Catalytic Domain
Mol. Mass.:
39657.52
Organism:
Homo sapiens (Human)
Description:
Leukotriene Cysteinyl 2 CYSLTR2 HUMAN::Q9NS75
Residue:
346
  
Inhibitor
Name:
BDBM50228527
Synonyms:
CHEMBL93991
Type:
Small organic molecule
Emp. Form.:
C27H25N5O
Mol. Mass.:
435.5203
SMILES:
C(Cc1nnn[nH]1)C(Cc1ccc(OCc2ccc3ccccc3n2)cc1)c1ccccc1
: