Target
Translocator protein
Ligand
BDBM22040
Substrate
Meas. Tech.
ChEMBL_1720334 (CHEMBL4135334)
IC50
11±n/a nM
Citation
 Kim, TSon, WSMorshed, MNLondhe, AMJung, SYPark, JHPark, WKLim, SMPark, KDCho, SJJeong, KSLee, JPae, AN Discovery of thienopyrrolotriazine derivatives to protect mitochondrial function against A?-induced neurotoxicity. Eur J Med Chem 141:240-256 (2017)  
Target
Name:
Translocator protein
Synonyms:
Benzodiazepine receptors; peripheral & central Mbr PBR Peripheral benzodiazepine receptor (PBR) TSPO_RAT | Tspo
Type:
Mitochondrion membrane protein
Mol. Mass.:
18945.84
Organism:
Rattus norvegicus (rat)
Description:
Competitive binding experiments were performed on rat kidney mitochondrial membranes.
Residue:
169
  
Inhibitor
Name:
BDBM22040
Synonyms:
4 -chlorodiazepam 7-chloro-5-(4-chlorophenyl)-1-methyl-1,3-dihydro-2H-1,4-benzodiazepin-2-one CHEMBL286346 Ro-05-4864 Ro5-4864
Type:
Small organic molecule
Emp. Form.:
C16H12Cl2N2O
Mol. Mass.:
319.185
SMILES:
CN1c2ccc(Cl)cc2C(=NCC1=O)c1ccc(Cl)cc1
: