Target
Nuclear receptor ROR-gamma
Ligand
BDBM20177
Substrate
Meas. Tech.
ChEMBL_1721966 (CHEMBL4136966)
EC50
20±n/a nM
Citation
 Qiu, RWang, Y Retinoic Acid Receptor-Related Orphan Receptor ?t (ROR?t) Agonists as Potential Small Molecule Therapeutics for Cancer Immunotherapy. J Med Chem 61:5794-5804 (2018)  
Target
Name:
Nuclear receptor ROR-gamma
Synonyms:
NR1F3 Nuclear receptor ROR-gamma (RORC) RAR-related orphan receptor C (RORc) RORG RZRG Retinoid-related orphan receptor-gamma (RORc)
Type:
Enzyme Catalytic Domain
Mol. Mass.:
58218.40
Organism:
Homo sapiens (Human)
Description:
P51449
Residue:
518
  
Inhibitor
Name:
BDBM20177
Synonyms:
(1S,2R,5S,10S,11S,14R,15S)-14-[(2S,3R)-3-hydroxy-6-methylheptan-2-yl]-2,15-dimethyltetracyclo[8.7.0.0^{2,7}.0^{11,15}]heptadec-7-en-5-ol CHEMBL422904
Type:
Steroid
Emp. Form.:
C27H46O2
Mol. Mass.:
402.6529
SMILES:
[H][C@@](O)(CCC(C)C)[C@@H](C)[C@@]1([H])CC[C@@]2([H])[C@]3([H])CC=C4C[C@@]([H])(O)CC[C@]4(C)[C@@]3([H])CC[C@]12C
: