Target
Ornithine decarboxylase
Ligand
BDBM50009385
Substrate
Meas. Tech.
ChEBML_147806
Ki
3300000±n/a nM
Citation
 Moyano, NFrydman, JBuldain, GRuiz, OFrydman, RB Inhibition of ornithine decarboxylase by the isomers of 1,4-dimethylputrescine. J Med Chem 33:1969-74 (1990)  
Target
Name:
Ornithine decarboxylase
Synonyms:
DCOR_RAT Odc1
Type:
PROTEIN
Mol. Mass.:
51037.04
Organism:
Rattus norvegicus
Description:
ChEMBL_1344641
Residue:
461
  
Inhibitor
Name:
BDBM50009385
Synonyms:
1,4-butylenediamine CHEMBL46257 Putrescin Tetramethylendiamin butylenediamine putrescine
Type:
Small organic molecule
Emp. Form.:
C4H12N2
Mol. Mass.:
88.1515
SMILES:
NCCCCN
: