Target
Toll-like receptor 7
Ligand
BDBM50240849
Substrate
Meas. Tech.
ChEMBL_1721300 (CHEMBL4136300)
EC50
11400±n/a nM
Citation
 Larson, PKucaba, TAXiong, ZOlin, MGriffith, TSFerguson, DM Design and Synthesis of N1-Modified Imidazoquinoline Agonists for Selective Activation of Toll-like Receptors 7 and 8. ACS Med Chem Lett 8:1148-1152 (2017)  
Target
Name:
Toll-like receptor 7
Synonyms:
ORF Names:UNQ248/PRO285 TLR7_HUMAN | Toll-like receptor 7 (TLR7)
Type:
Enzyme
Mol. Mass.:
120945.35
Organism:
Homo sapiens (Human)
Description:
Q9NYK1
Residue:
1049
  
Inhibitor
Name:
BDBM50240849
Synonyms:
1-(2-methylpropyl)-1H-imidazo[4,5-c]quinolin-4-amine 4-Amino-1-isobutyl-1H-imidazo(4,5-c)quinoline IMIQUIMOD | R 837
Type:
Small organic molecule
Emp. Form.:
C14H16N4
Mol. Mass.:
240.3036
SMILES:
CC(C)Cn1cnc2c(N)nc3ccccc3c12
: