Target
Sigma intracellular receptor 2
Ligand
BDBM50062551
Substrate
Meas. Tech.
ChEMBL_1722785 (CHEMBL4137785)
Ki
32±n/a nM
Citation
 Bautista-Aguilera, ÓMBudni, JMina, FMedeiros, EBDeuther-Conrad, WEntrena, JMMoraleda, IIriepa, ILópez-Muñoz, FMarco-Contelles, J Contilisant, a Tetratarget Small Molecule for Alzheimer's Disease Therapy Combining Cholinesterase, Monoamine Oxidase Inhibition, and H3R Antagonism with S1R Agonism Profile. J Med Chem 61:6937-6943 (2018)  
Target
Name:
Sigma intracellular receptor 2
Synonyms:
S2r Sigma intracellular receptor 2 Sigma2 receptor Transmembrane protein 97
Type:
Protein
Mol. Mass.:
20953.88
Organism:
Rattus norvegicus (Rat)
Description:
Q5U3Y7
Residue:
176
  
Inhibitor
Name:
BDBM50062551
Synonyms:
CHEBI:76010 GSK1349572 | S-349572
Type:
Small organic molecule
Emp. Form.:
C20H19F2N3O5
Mol. Mass.:
419.3788
SMILES:
[H][C@]12Cn3cc(C(=O)NCc4ccc(F)cc4F)c(=O)c(O)c3C(=O)N1[C@H](C)CCO2
: