Target
Neutrophil elastase
Ligand
BDBM50015925
Substrate
Meas. Tech.
ChEBML_63658
IC50
1620±n/a nM
Citation
 Shah, SKBrause, KAChandler, GOFinke, PEAshe, BMWeston, HKnight, WBMaycock, ALDoherty, JB Inhibition of human leukocyte elastase. 3. Synthesis and activity of 3'-substituted cephalosporins. J Med Chem 33:2529-35 (1990)  
Target
Name:
Neutrophil elastase
Synonyms:
Bone marrow serine protease Coagulation factor X ELANE Elastase HLE Leukocyte elastase Medullasin Neutrophil elastase (HNE) PMN elastase Trypsin
Type:
Enzyme
Mol. Mass.:
28532.38
Organism:
Homo sapiens (Human)
Description:
P08246
Residue:
267
  
Inhibitor
Name:
BDBM50015925
Synonyms:
(S)-7-Methoxy-3-(1-methyl-1H-tetrazol-5-ylsulfanylmethyl)-5,5,8-trioxo-5lambda*6*-thia-1-aza-bicyclo[4.2.0]oct-2-ene-2-carboxylic acid tert-butyl ester CHEMBL81892
Type:
Small organic molecule
Emp. Form.:
C15H21N5O6S2
Mol. Mass.:
431.487
SMILES:
CO[C@@H]1C2N(C1=O)C(C(=O)OC(C)(C)C)=C(CSc1nnnn1C)CS2(=O)=O
: