Target
Nuclear receptor ROR-alpha
Ligand
BDBM50281849
Substrate
Meas. Tech.
ChEMBL_1722944 (CHEMBL4137944)
IC50
4113±n/a nM
Citation
 Carcache, DAVulpetti, AKallen, JMattes, HOrain, DStringer, RVangrevelinghe, EWolf, RMKaupmann, KOttl, JDawson, JCooke, NGHoegenauer, KBillich, AWagner, JGuntermann, CHintermann, S Optimizing a Weakly Binding Fragment into a Potent ROR?t Inverse Agonist with Efficacy in an in Vivo Inflammation Model. J Med Chem 61:6724-6735 (2018)  
Target
Name:
Nuclear receptor ROR-alpha
Synonyms:
NR1F1 Nuclear receptor subfamily 1 group F member 1 RORA RZRA | Retinoid-related orphan receptor-alpha
Type:
PROTEIN
Mol. Mass.:
58976.26
Organism:
Homo sapiens (Human)
Description:
ChEMBL_101591
Residue:
523
  
Inhibitor
Name:
BDBM50281849
Synonyms:
CHEMBL4175305
Type:
Small organic molecule
Emp. Form.:
C23H23ClN2O4S
Mol. Mass.:
458.958
SMILES:
CCS(=O)(=O)c1ccc(CC(=O)Nc2cnc(O[C@@H](C)c3ccccc3)c(Cl)c2)cc1
: