Target
Lethal(3)malignant brain tumor-like protein 1
Ligand
BDBM50282169
Substrate
Meas. Tech.
ChEMBL_1723525 (CHEMBL4138803)
IC50
98±n/a nM
Citation
 Teske, KAHadden, MK Methyllysine binding domains: Structural insight and small molecule probe development. Eur J Med Chem 136:14-35 (2017)  
Target
Name:
Lethal(3)malignant brain tumor-like protein 1
Synonyms:
H-l(3)mbt KIAA0681 L(3)mbt-like L3MBTL LMBL1_HUMAN
Type:
PROTEIN
Mol. Mass.:
92284.44
Organism:
Homo sapiens
Description:
ChEMBL_103624
Residue:
840
  
Inhibitor
Name:
BDBM50282169
Synonyms:
CHEBI:3507 | Cefsulodin
Type:
Small organic molecule
Emp. Form.:
C22H20N4O8S2
Mol. Mass.:
532.546
SMILES:
[H][C@]12SCC(C[n+]3ccc(cc3)C(N)=O)=C(N1C(=O)[C@H]2NC(=O)[C@@H](c1ccccc1)S([O-])(=O)=O)C(O)=O
: