Target
Alpha-1D adrenergic receptor
Ligand
BDBM86731
Substrate
Meas. Tech.
ChEMBL_1723942 (CHEMBL4139220)
Ki
0.323594±n/a nM
Citation
 Maestri, VTarozzi, ASimoni, ECilia, APoggesi, ENaldi, MNicolini, BPruccoli, LRosini, MMinarini, A Quinazoline based ? Eur J Med Chem 136:259-269 (2017)  
Target
Name:
Alpha-1D adrenergic receptor
Synonyms:
ADA1D_HUMAN ADRA1D Adrenergic receptor alpha Alpha 1D-adrenoreceptor Alpha-1D adrenoceptor adrenergic Alpha1D
Type:
Enzyme Catalytic Domain
Mol. Mass.:
60485.82
Organism:
Homo sapiens (Human)
Description:
adrenergic Alpha1D ADRA1D HUMAN::P25100
Residue:
572
  
Inhibitor
Name:
BDBM86731
Synonyms:
CAS_74191-85-8 UK 33,274
Type:
Small organic molecule
Emp. Form.:
C23H25N5O5
Mol. Mass.:
451.4751
SMILES:
COc1cc2nc(nc(N)c2cc1OC)N1CCN(CC1)C(=O)C1COc2ccccc2O1
: