Target
Voltage-dependent L-type calcium channel subunit alpha-1C
Ligand
BDBM50016388
Substrate
Meas. Tech.
ChEBML_42759
Ki
505±n/a nM
Citation
 Atwal, KSBergey, JLHedberg, AMoreland, S Synthesis and biological activity of novel calcium channel blockers: 2,5-dihydro-4-methyl-2-phenyl-1,5-benzothiazepine-3-carboxylic acid esters and 2,5-dihydro-4-methyl-2-phenyl-1,5-benzodiazepine-3-carboxylic acid esters. J Med Chem 30:635-40 (1987)  
Target
Name:
Voltage-dependent L-type calcium channel subunit alpha-1C
Synonyms:
CAC1C_HUMAN CACN2 CACNL1A1 Calcium channel (Type L) L-type calcium channel alpha-1c/beta-2/alpha2delta-1 Voltage-gated L-type calcium channel Voltage-gated calcium channel | Voltage-gated calcium channel subunit alpha Cav1.2
Type:
Enzyme Catalytic Domain
Mol. Mass.:
248979.79
Organism:
Homo sapiens (Human)
Description:
Calcium channel (Type L) 0 HUMAN::Q13936
Residue:
2221
  
Inhibitor
Name:
BDBM50016388
Synonyms:
5-(2-Dimethylamino-ethyl)-4-methyl-2-(3-nitro-phenyl)-2,5-dihydro-benzo[b][1,4]thiazepine-3-carboxylic acid methyl ester | CHEMBL345843
Type:
Small organic molecule
Emp. Form.:
C22H25N3O4S
Mol. Mass.:
427.517
SMILES:
COC(=O)C1=C(C)N(CCN(C)C)c2ccccc2SC1c1cccc(c1)[N+]([O-])=O
: