Target
Cholecystokinin receptor type A
Ligand
BDBM50016504
Substrate
Meas. Tech.
ChEMBL_49394 (CHEMBL658756)
Ki
0.230000±n/a nM
Citation
 Marseigne, IRoy, PDor, ADurieux, CPélaprat, DReibaud, MBlanchard, JCRoques, BP Full agonists of CCK8 containing a nonhydrolyzable sulfated tyrosine residue. J Med Chem 32:445-9 (1989)  
Target
Name:
Cholecystokinin receptor type A
Synonyms:
CCK-A receptor CCK1-R CCKAR_CAVPO Cholecystokinin receptor type A | Cholecystokinin-1 receptor
Type:
Mol. Mass.:
48229.77
Organism:
Cavia porcellus
Description:
Residue:
430
  
Inhibitor
Name:
BDBM50016504
Synonyms:
(S)-3-(2-{[(S)-2-(2-{2-[2-tert-Butoxycarbonylamino-3-((S)-4-sulfooxy-phenyl)-propionylamino]-hexanoylamino}-acetylamino)-3-(1H-indol-3-yl)-propionyl]-methyl-amino}-hexanoylamino)-N-((S)-1-carbamoyl-2-phenyl-ethyl)-succinamic acid Boc-Asp-Tyr(SO3Na)-Nle-Gly-Trp-Nle-Asp-Phe-NH2 CHEMBL428666
Type:
Small organic molecule
Emp. Form.:
C52H68N9O15S
Mol. Mass.:
1091.213
SMILES:
CCCC[C@H](NC(=O)[C@H](Cc1ccc(OS([O-])(=O)=O)cc1)NC(=O)OC(C)(C)C)C(=O)NCC(=O)N[C@@H](Cc1c[nH]c2ccccc12)C(=O)N[C@@H](CCCC)C(=O)N[C@@H](CC(O)=O)C(=O)N[C@@H](Cc1ccccc1)C(N)=O
: