Target
D(2) dopamine receptor
Ligand
BDBM50010698
Substrate
Meas. Tech.
ChEMBL_58205 (CHEMBL672776)
Kd
1.1±n/a nM
Citation
 Ramsby, SNeumeyer, JLGrigoriadis, DSeeman, P 2-Haloaporphines as potent dopamine agonists. J Med Chem 32:1198-201 (1989)  
Target
Name:
D(2) dopamine receptor
Synonyms:
D(2) dopamine receptor DOPAMINE D2 Long DRD2 Dopamine D2 receptor Dopamine D2 receptor (D2R) Dopamine2-like | d2
Type:
Cell-surface receptors
Mol. Mass.:
50647.10
Organism:
Homo sapiens (Human)
Description:
P14416
Residue:
443
  
Inhibitor
Name:
BDBM50010698
Synonyms:
(-)6-Methyl-5,6,6a,7-tetrahydro-4H-dibenzo[de,g]quinoline-2,10,11-triol 6-Methyl-5,6,6a,7-tetrahydro-4H-dibenzo[de,g]quinoline-2,10,11-triol | CHEMBL19130
Type:
Small organic molecule
Emp. Form.:
C17H17NO3
Mol. Mass.:
283.3218
SMILES:
CN1CCc2cc(O)cc-3c2[C@H]1Cc1ccc(O)c(O)c-31
: