Target
E3 ubiquitin-protein ligase Mdm2
Ligand
BDBM50287706
Substrate
Meas. Tech.
ChEMBL_1729768 (CHEMBL4145046)
IC50
624±n/a nM
Citation
 Merlino, FDaniele, SLa Pietra, VDi Maro, SDi Leva, FSBrancaccio, DTomassi, SGiuntini, SCerofolini, LFragai, MLuchinat, CReichart, FCavallini, CCosta, BPiccarducci, RTaliani, SDa Settimo, FMartini, CKessler, HNovellino, EMarinelli, L Simultaneous Targeting of RGD-Integrins and Dual Murine Double Minute Proteins in Glioblastoma Multiforme. J Med Chem 61:4791-4809 (2018)  
Target
Name:
E3 ubiquitin-protein ligase Mdm2
Synonyms:
Double minute 2 protein E3 ubiquitin-protein ligase Mdm2 (p53-binding protein Mdm2) Human Double Minute 2 (HDM2) MDM2-MDMX p53-Binding Protein MDM2 | p53-binding protein
Type:
Oncoprotein
Mol. Mass.:
55196.54
Organism:
Homo sapiens (Human)
Description:
Q00987
Residue:
491
  
Inhibitor
Name:
BDBM50287706
Synonyms:
CHEMBL4173995
Type:
Small organic molecule
Emp. Form.:
C21H23ClN6O5
Mol. Mass.:
474.898
SMILES:
NC(=N)Nc1cccc(c1)C(=O)NCC(=O)N[C@@H](CC(O)=O)C(=O)NCc1ccc(Cl)cc1
: