Target
Tyrosine-protein kinase JAK1
Ligand
BDBM50288379
Substrate
Meas. Tech.
ChEMBL_1729905 (CHEMBL4145183)
IC50
55±n/a nM
Citation
 Grimster, NPAnderson, EAlimzhanov, MBebernitz, GBell, KChuaqui, CDeegan, TFerguson, ADGero, THarsch, AHuszar, DKawatkar, AKettle, JGLyne, PRead, JARivard Costa, CRuston, LSchroeder, PShi, JSu, QThroner, SToader, DVasbinder, MWoessner, RWang, HWu, AYe, MZheng, WZinda, M Discovery and Optimization of a Novel Series of Highly Selective JAK1 Kinase Inhibitors. J Med Chem 61:5235-5244 (2018)  
Target
Name:
Tyrosine-protein kinase JAK1
Synonyms:
JAK-1 JAK1A JAK1_HUMAN Janus kinase 1 (JAK1) | Janus kinase 1 JAK1
Type:
Protein
Mol. Mass.:
133293.73
Organism:
Homo sapiens (Human)
Description:
P23458
Residue:
1154
  
Inhibitor
Name:
BDBM50288379
Synonyms:
CHEMBL4175654
Type:
Small organic molecule
Emp. Form.:
C25H27F3N6O
Mol. Mass.:
484.5167
SMILES:
[H][C@]12CN(c3cc(Nc4ncc(C)c(Nc5cccc(CO)c5)n4)c(F)c(c3)C(F)F)[C@]([H])(CN1C)C2
: