Target
Tyrosine-protein kinase JAK2
Ligand
BDBM50288512
Substrate
Meas. Tech.
ChEMBL_1729906 (CHEMBL4145184)
IC50
347±n/a nM
Citation
 Grimster, NPAnderson, EAlimzhanov, MBebernitz, GBell, KChuaqui, CDeegan, TFerguson, ADGero, THarsch, AHuszar, DKawatkar, AKettle, JGLyne, PRead, JARivard Costa, CRuston, LSchroeder, PShi, JSu, QThroner, SToader, DVasbinder, MWoessner, RWang, HWu, AYe, MZheng, WZinda, M Discovery and Optimization of a Novel Series of Highly Selective JAK1 Kinase Inhibitors. J Med Chem 61:5235-5244 (2018)  
Target
Name:
Tyrosine-protein kinase JAK2
Synonyms:
JAK-2 JAK2_HUMAN Janus kinase 2 (JAK2) | Janus kinase 2 (a protein tyrosine kinase)
Type:
Protein
Mol. Mass.:
130684.68
Organism:
Homo sapiens (Human)
Description:
O60674
Residue:
1132
  
Inhibitor
Name:
BDBM50288512
Synonyms:
CHEMBL4163122
Type:
Small organic molecule
Emp. Form.:
C25H30N6O4S
Mol. Mass.:
510.608
SMILES:
CC(=O)N1CCN(CC1)c1cc(Nc2ncc(C)c(Nc3cccc(CO)c3)n2)cc(c1)S(C)(=O)=O
: