Target
5-hydroxytryptamine receptor 6
Ligand
BDBM50318633
Substrate
Meas. Tech.
ChEMBL_1730867 (CHEMBL4146403)
Ki
0.280000±n/a nM
Citation
 Vanda, DSoural, MCanale, VChaumont-Dubel, SSata?a, GKos, TFunk, PFülöpová, VLemrová, BKoczurkiewicz, PP?kala, EBojarski, AJPopik, PMarin, PZajdel, P Novel non-sulfonamide 5-HT Eur J Med Chem 144:716-729 (2018)  
Target
Name:
5-hydroxytryptamine receptor 6
Synonyms:
5-HT-6 5-hydroxytryptamine receptor 6 (5-HT-6) 5-hydroxytryptamine receptor 6 (5HT6) HTR6 Serotonin 6 (5-HT6) receptor | Serotonin Receptor 6
Type:
G Protein-Coupled Receptor (GPCR)
Mol. Mass.:
46968.43
Organism:
Homo sapiens (Human)
Description:
P50406
Residue:
440
  
Inhibitor
Name:
BDBM50318633
Synonyms:
3-benzenesulfonyl-8-piperazin-1-ylquinoline SB-742457
Type:
Small organic molecule
Emp. Form.:
C19H19N3O2S
Mol. Mass.:
353.438
SMILES:
O=S(=O)(c1ccccc1)c1cnc2c(cccc2c1)N1CCNCC1
: