Target
Neuromedin-U receptor 2
Ligand
BDBM50049422
Substrate
Meas. Tech.
ChEMBL_1731400 (CHEMBL4146936)
IC50
44±n/a nM
Citation
 De Prins, AMartin, CVan Wanseele, YSkov, LJTömböly, CTourwé, DCaveliers, VVan Eeckhaut, AHolst, BRosenkilde, MMSmolders, IBallet, S Development of potent and proteolytically stable human neuromedin U receptor agonists. Eur J Med Chem 144:887-897 (2018)  
Target
Name:
Neuromedin-U receptor 2
Synonyms:
G-protein coupled receptor FM-4 NMU-R2 NMU2R NMUR2_HUMAN TGR1
Type:
PROTEIN
Mol. Mass.:
47710.86
Organism:
Homo sapiens (Human)
Description:
ChEMBL_103075
Residue:
415
  
Inhibitor
Name:
BDBM50049422
Synonyms:
CHEMBL3315335
Type:
Small organic molecule
Emp. Form.:
C39H70N12O8
Mol. Mass.:
835.0487
SMILES:
CC(C)C[C@H](NC(=O)CCC1CCCCC1)C(=O)N[C@@H](CC(C)C)C(=O)N[C@@H](CN)C(=O)N1CCC[C@H]1C(=O)N[C@@H](CCCNC(N)=N)C(=O)N[C@@H](CC(N)=O)C(N)=O
: