Target
C-C chemokine receptor type 5
Ligand
BDBM50336345
Substrate
Meas. Tech.
ChEMBL_1732906 (CHEMBL4148442)
IC50
0.400000±n/a nM
Citation
 Shah, HRSavjani, JK Recent updates for designing CCR5 antagonists as anti-retroviral agents. Eur J Med Chem 147:115-129 (2018)  
Target
Name:
C-C chemokine receptor type 5
Synonyms:
C-C CKR-5 CCR-5 CD_antigen=CD195 Cmkbr5 | MIP-1 alpha receptor
Type:
PROTEIN
Mol. Mass.:
40803.93
Organism:
Mus musculus
Description:
ChEMBL_49996
Residue:
354
  
Inhibitor
Name:
BDBM50336345
Synonyms:
4-(4-(((R)-1-butyl-3-((R)-cyclohexyl(hydroxy)methyl)-2,5-dioxo-1,4,9-triazaspiro[5.5]undecan-9-yl)methyl)phenoxy)benzoic acid hydrochloride CHEMBL1668019
Type:
Small organic molecule
Emp. Form.:
C33H43N3O6
Mol. Mass.:
577.711
SMILES:
CCCCN1C(=O)[C@H](NC(=O)C11CCN(Cc2ccc(Oc3ccc(cc3)C(O)=O)cc2)CC1)[C@H](O)C1CCCCC1
: