Target
Induced myeloid leukemia cell differentiation protein Mcl-1 homolog
Ligand
BDBM50314864
Substrate
Meas. Tech.
ChEMBL_1733219 (CHEMBL4148755)
Ki
460±n/a nM
Citation
 Abou Samra, ARobert, AGov, CFavre, LEloy, LJacquet, EBignon, JWiels, JDesrat, SRoussi, F Dual inhibitors of the pro-survival proteins Bcl-2 and Mcl-1 derived from natural compound meiogynin A. Eur J Med Chem 148:26-38 (2018)  
Target
Name:
Induced myeloid leukemia cell differentiation protein Mcl-1 homolog
Synonyms:
Bcl-2-related protein EAT/mcl1 Mcl-1 | Mcl1
Type:
Developmental protein
Mol. Mass.:
35215.08
Organism:
Mus musculus (Mouse)
Description:
Residue:
331
  
Inhibitor
Name:
BDBM50314864
Synonyms:
CHEMBL4172927
Type:
Small organic molecule
Emp. Form.:
C45H42ClNO9
Mol. Mass.:
776.269
SMILES:
[H][C@]12C[C@H](CCOC(=O)c3ccc(Oc4ccc(NC(=O)COc5ccc(C)cc5)cc4)cc3)C=C[C@]1([C@H](\C=C(/Cl)c1ccc(cc1)C(O)=O)C=C(C)C2)C(O)=O
: