Target
Bcl-2-like protein 1
Ligand
BDBM50314865
Substrate
Meas. Tech.
ChEMBL_1733218 (CHEMBL4148754)
Ki
150±n/a nM
Citation
 Abou Samra, ARobert, AGov, CFavre, LEloy, LJacquet, EBignon, JWiels, JDesrat, SRoussi, F Dual inhibitors of the pro-survival proteins Bcl-2 and Mcl-1 derived from natural compound meiogynin A. Eur J Med Chem 148:26-38 (2018)  
Target
Name:
Bcl-2-like protein 1
Synonyms:
Anti-apoptotic Bcl-2 protein Apoptosis regulator Bcl-X BCL2-like 1 isoform 1 BCL2L1 Bcl-2-like protein 1 (Bcl-XL) Bcl-xL/Bcl-2-binding component 3 Bcl2-antagonist of cell death (BAD)
Type:
Mitochondrion membrane; Single-pass membrane protein
Mol. Mass.:
26039.60
Organism:
Homo sapiens (Human)
Description:
Residue:
233
  
Inhibitor
Name:
BDBM50314865
Synonyms:
CHEMBL4172616
Type:
Small organic molecule
Emp. Form.:
C35H32ClNO7
Mol. Mass.:
614.084
SMILES:
[H][C@]12C[C@H](CCOC(=O)c3ccc(Oc4cccnc4)cc3)C=C[C@]1([C@H](\C=C(/Cl)c1ccc(cc1)C(O)=O)C=C(C)C2)C(O)=O
: