Target
Induced myeloid leukemia cell differentiation protein Mcl-1 homolog
Ligand
BDBM50314866
Substrate
Meas. Tech.
ChEMBL_1733219 (CHEMBL4148755)
Ki
5200±n/a nM
Citation
 Abou Samra, ARobert, AGov, CFavre, LEloy, LJacquet, EBignon, JWiels, JDesrat, SRoussi, F Dual inhibitors of the pro-survival proteins Bcl-2 and Mcl-1 derived from natural compound meiogynin A. Eur J Med Chem 148:26-38 (2018)  
Target
Name:
Induced myeloid leukemia cell differentiation protein Mcl-1 homolog
Synonyms:
Bcl-2-related protein EAT/mcl1 Mcl-1 | Mcl1
Type:
Developmental protein
Mol. Mass.:
35215.08
Organism:
Mus musculus (Mouse)
Description:
Residue:
331
  
Inhibitor
Name:
BDBM50314866
Synonyms:
CHEMBL4161959
Type:
Small organic molecule
Emp. Form.:
C30H44O4
Mol. Mass.:
468.668
SMILES:
[H][C@@]1(C[C@]2([H])CC(C)=C[C@@H](\C=C(/C)[C@H]3CCC(CC3)C(O)=O)[C@@]2(C=C1)C(O)=O)[C@@H](C)CCC=C(C)C
: