Target
Induced myeloid leukemia cell differentiation protein Mcl-1 homolog
Ligand
BDBM50314884
Substrate
Meas. Tech.
ChEMBL_1733219 (CHEMBL4148755)
Ki
6830±n/a nM
Citation
 Abou Samra, ARobert, AGov, CFavre, LEloy, LJacquet, EBignon, JWiels, JDesrat, SRoussi, F Dual inhibitors of the pro-survival proteins Bcl-2 and Mcl-1 derived from natural compound meiogynin A. Eur J Med Chem 148:26-38 (2018)  
Target
Name:
Induced myeloid leukemia cell differentiation protein Mcl-1 homolog
Synonyms:
Bcl-2-related protein EAT/mcl1 Mcl-1 | Mcl1
Type:
Developmental protein
Mol. Mass.:
35215.08
Organism:
Mus musculus (Mouse)
Description:
Residue:
331
  
Inhibitor
Name:
BDBM50314884
Synonyms:
CHEMBL4167271
Type:
Small organic molecule
Emp. Form.:
C36H37Cl2NO9
Mol. Mass.:
698.586
SMILES:
[H][C@]12C[C@H](CC(=O)NCc3ccc(Cl)cc3)C=C[C@]1([C@H](\C=C(/Cl)c1ccc(cc1)C(=O)OCOC(C)=O)C=C(C)C2)C(=O)OCOC(C)=O
: