Target
Apoptosis regulator Bcl-2
Ligand
BDBM50315693
Substrate
Meas. Tech.
ChEMBL_1733220 (CHEMBL4148756)
Ki
2220±n/a nM
Citation
 Abou Samra, ARobert, AGov, CFavre, LEloy, LJacquet, EBignon, JWiels, JDesrat, SRoussi, F Dual inhibitors of the pro-survival proteins Bcl-2 and Mcl-1 derived from natural compound meiogynin A. Eur J Med Chem 148:26-38 (2018)  
Target
Name:
Apoptosis regulator Bcl-2
Synonyms:
Apoptosis regulator Bcl-2 Protein BCL-2 BCL2_HUMAN | Bcl-2 Protein
Type:
Homodimer or heterodimer
Mol. Mass.:
26269.11
Organism:
Homo sapiens (Human)
Description:
P10415
Residue:
239
  
Inhibitor
Name:
BDBM50315693
Synonyms:
CHEMBL4166826
Type:
Small organic molecule
Emp. Form.:
C32H32ClN3O4
Mol. Mass.:
558.067
SMILES:
[H][C@]12C[C@H](CCn3cc(Cc4ccccc4)nn3)C=C[C@]1([C@H](\C=C(/Cl)c1ccc(cc1)C(O)=O)C=C(C)C2)C(O)=O
: