Target
Carbonic anhydrase 5A, mitochondrial
Ligand
BDBM50341393
Substrate
Meas. Tech.
ChEMBL_1734317 (CHEMBL4149853)
Ki
7.1±n/a nM
Citation
 Angeli, Adi Cesare Mannelli, LTrallori, EPeat, TSGhelardini, CCarta, FSupuran, CT Design, Synthesis, and X-ray of Selenides as New Class of Agents for Prevention of Diabetic Cerebrovascular Pathology. ACS Med Chem Lett 9:462-467 (2018)  
Target
Name:
Carbonic anhydrase 5A, mitochondrial
Synonyms:
CA-VA CA5A Carbonate dehydratase VA Carbonic anhydrase 5A (CA VA) Carbonic anhydrase 5A, mitochondrial precursor Carbonic anhydrase VA (CA VA)
Type:
Enzyme
Mol. Mass.:
34755.54
Organism:
Homo sapiens (Human)
Description:
Human (cloned) isozyme
Residue:
305
  
Inhibitor
Name:
BDBM50341393
Synonyms:
CHEMBL4165154
Type:
Small organic molecule
Emp. Form.:
C9H13NO2SSe
Mol. Mass.:
278.23
SMILES:
[#6]-[#6](-[#6])[Se;v2]c1ccc(cc1)S([#7])(=O)=O
: