Target
Carbonic anhydrase 7
Ligand
BDBM50341394
Substrate
Meas. Tech.
ChEMBL_1734319 (CHEMBL4149855)
Ki
0.380000±n/a nM
Citation
 Angeli, Adi Cesare Mannelli, LTrallori, EPeat, TSGhelardini, CCarta, FSupuran, CT Design, Synthesis, and X-ray of Selenides as New Class of Agents for Prevention of Diabetic Cerebrovascular Pathology. ACS Med Chem Lett 9:462-467 (2018)  
Target
Name:
Carbonic anhydrase 7
Synonyms:
CA-VII CAH7_HUMAN Carbonic anhydrase Carbonic anhydrase VII (CA VII)
Type:
Enzyme
Mol. Mass.:
29664.11
Organism:
Homo sapiens (Human)
Description:
Human cloned isozyme.
Residue:
264
  
Inhibitor
Name:
BDBM50341394
Synonyms:
CHEMBL4171921
Type:
Small organic molecule
Emp. Form.:
C11H17NO2SSe
Mol. Mass.:
306.28
SMILES:
[#6]-[#6]-[#6]-[#6]-[#6][Se;v2]c1ccc(cc1)S([#7])(=O)=O
: