Target
Free fatty acid receptor 4
Ligand
BDBM50367220
Substrate
Meas. Tech.
ChEMBL_1735781 (CHEMBL4151317)
EC50
>10000±n/a nM
Citation
 Chen, HYPlummer, CWXiao, DChobanian, HRDeMong, DMiller, MTrujillo, MEKirkland, MKosinski, DMane, JPachanski, MCheewatrakoolpong, BDi Salvo, JThomas-Fowlkes, BSouza, STatosian, DAChen, QHafey, MJHoule, RNolting, AFOrr, REhrhart, JWeinglass, ABTschirret-Guth, RHoward, ADColletti, SL Structure-Activity Relationship of Novel and Selective Biaryl-Chroman GPR40 AgoPAMs. ACS Med Chem Lett 9:685-690 (2018)  
Target
Name:
Free fatty acid receptor 4
Synonyms:
FFAR4 G-protein coupled receptor 120 G-protein coupled receptor GT01 GPR120 O3FAR1 PGR4
Type:
PROTEIN
Mol. Mass.:
42256.91
Organism:
Homo sapiens (Human)
Description:
ChEMBL_1508994
Residue:
377
  
Inhibitor
Name:
BDBM50367220
Synonyms:
CHEMBL4168422
Type:
Small organic molecule
Emp. Form.:
C27H26FN2NaO4
Mol. Mass.:
484.4945
SMILES:
[Na;v0+].[#6]-[#8]-c1cc(c(F)cn1)-c1ccc(nc1)-[#6]-1-[#6]-[#6]-c2ccc(cc2-[#8]-1)-[#6@@H](-[#6@H](-[#6])-[#6](-[#8-])=O)-[#6]-1-[#6]-[#6]-1
: