Target
Free fatty acid receptor 1
Ligand
BDBM50210155
Substrate
Meas. Tech.
ChEMBL_1735722 (CHEMBL4151258)
EC50
7.0±n/a nM
Citation
 Chen, HYPlummer, CWXiao, DChobanian, HRDeMong, DMiller, MTrujillo, MEKirkland, MKosinski, DMane, JPachanski, MCheewatrakoolpong, BDi Salvo, JThomas-Fowlkes, BSouza, STatosian, DAChen, QHafey, MJHoule, RNolting, AFOrr, REhrhart, JWeinglass, ABTschirret-Guth, RHoward, ADColletti, SL Structure-Activity Relationship of Novel and Selective Biaryl-Chroman GPR40 AgoPAMs. ACS Med Chem Lett 9:685-690 (2018)  
Target
Name:
Free fatty acid receptor 1
Synonyms:
FFAR1 G-protein Coupled Receptor 40 | GPR40
Type:
G Protein-Coupled Receptor (GPCR)
Mol. Mass.:
31473.32
Organism:
Homo sapiens (Human)
Description:
O14842
Residue:
300
  
Inhibitor
Name:
BDBM50210155
Synonyms:
CHEMBL3883407
Type:
Small organic molecule
Emp. Form.:
C28H27FO4
Mol. Mass.:
446.51
SMILES:
COc1ccc(F)c(c1)-c1ccc(cc1)C1CCc2ccc(cc2O1)[C@@H](CC(O)=O)C1CC1
: