Target
Free fatty acid receptor 1
Ligand
BDBM50367244
Substrate
Meas. Tech.
ChEMBL_1735722 (CHEMBL4151258)
EC50
5.9±n/a nM
Citation
 Chen, HYPlummer, CWXiao, DChobanian, HRDeMong, DMiller, MTrujillo, MEKirkland, MKosinski, DMane, JPachanski, MCheewatrakoolpong, BDi Salvo, JThomas-Fowlkes, BSouza, STatosian, DAChen, QHafey, MJHoule, RNolting, AFOrr, REhrhart, JWeinglass, ABTschirret-Guth, RHoward, ADColletti, SL Structure-Activity Relationship of Novel and Selective Biaryl-Chroman GPR40 AgoPAMs. ACS Med Chem Lett 9:685-690 (2018)  
Target
Name:
Free fatty acid receptor 1
Synonyms:
FFAR1 G-protein Coupled Receptor 40 | GPR40
Type:
G Protein-Coupled Receptor (GPCR)
Mol. Mass.:
31473.32
Organism:
Homo sapiens (Human)
Description:
O14842
Residue:
300
  
Inhibitor
Name:
BDBM50367244
Synonyms:
CHEMBL4166625
Type:
Small organic molecule
Emp. Form.:
C28H28NNaO4
Mol. Mass.:
465.516
SMILES:
[Na;v0+].[#6]-[#8]-c1cc(ccn1)-c1ccc(cc1)-[#6]-1-[#6]-[#6]-c2ccc(cc2-[#8]-1)-[#6@@H](-[#6@H](-[#6])-[#6](-[#8-])=O)-[#6]-1-[#6]-[#6]-1
: