Target
Cyclin-A2/Cyclin-dependent kinase 2
Ligand
BDBM50367843
Substrate
Meas. Tech.
ChEMBL_1735964 (CHEMBL4151500)
IC50
4800±n/a nM
Citation
 Ito, MTanaka, TToita, AUchiyama, NKokubo, HMorishita, NKlein, MGZou, HMurakami, MKondo, MSameshima, TAraki, SEndo, SKawamoto, TMorin, GBAparicio, SANakanishi, AMaezaki, HImaeda, Y Discovery of 3-Benzyl-1-( trans-4-((5-cyanopyridin-2-yl)amino)cyclohexyl)-1-arylurea Derivatives as Novel and Selective Cyclin-Dependent Kinase 12 (CDK12) Inhibitors. J Med Chem 61:7710-7728 (2018)  
Target
Name:
Cyclin-A2/Cyclin-dependent kinase 2
Synonyms:
CDK2-CyclinA CDK2/Cyclin A Cyclin A2/dependent kinase 2 Cyclin-Dependent Kinase 2 (CDK2A)
Type:
Protein Complex
Mol. Mass.:
Description:
Cdk2/Cyclin A kinase was purified from insect cells coinfected with Cyclin A/Cdk2 baculovirus.
Components:
This complex has 2 components.
Component 1
Name:
Cyclin-dependent kinase 2
Synonyms:
CDK2 CDK2_HUMAN Cell division protein kinase 2 Protein cereblon/Cyclin-dependent kinase 2 | p33 protein kinase
Type:
Enzyme Subunit
Mol. Mass.:
33938.17
Organism:
Homo sapiens (Human)
Description:
P24941
Residue:
298
  
Component 2
Name:
Cyclin-A2
Synonyms:
CCN1 CCNA1 CCNA2_HUMAN Cyclin-A
Type:
Enzyme Subunit
Mol. Mass.:
48550.19
Organism:
Homo sapiens (Human)
Description:
P20248
Residue:
432
  
Inhibitor
Name:
BDBM50367843
Synonyms:
CHEMBL4174324
Type:
Small organic molecule
Emp. Form.:
C25H29N7O
Mol. Mass.:
443.5441
SMILES:
CCNC(=O)N([C@H]1CC[C@@H](CC1)Nc1ccc(cn1)C#N)c1ccc(cc1)-c1cnn(C)c1
: