Target
Cyclin-T1/Cyclin-dependent kinase 9
Ligand
BDBM50367682
Substrate
Meas. Tech.
ChEMBL_1735960 (CHEMBL4151496)
IC50
220±n/a nM
Citation
 Ito, MTanaka, TToita, AUchiyama, NKokubo, HMorishita, NKlein, MGZou, HMurakami, MKondo, MSameshima, TAraki, SEndo, SKawamoto, TMorin, GBAparicio, SANakanishi, AMaezaki, HImaeda, Y Discovery of 3-Benzyl-1-( trans-4-((5-cyanopyridin-2-yl)amino)cyclohexyl)-1-arylurea Derivatives as Novel and Selective Cyclin-Dependent Kinase 12 (CDK12) Inhibitors. J Med Chem 61:7710-7728 (2018)  
Target
Name:
Cyclin-T1/Cyclin-dependent kinase 9
Synonyms:
CDK9/ Cyclin-T1 CDK9/Cyclin T Cyclin T1/dependent kinase 9 | Cyclin-Dependent Kinase 9 (CDK9)
Type:
Protein Complex
Mol. Mass.:
Description:
Components:
This complex has 2 components.
Component 1
Name:
Cyclin-T1
Synonyms:
CCNT1 CycT Cyclin T Cyclin-T
Type:
Enzyme Subunit
Mol. Mass.:
80712.40
Organism:
Homo sapiens (Human)
Description:
Residue:
726
  
Component 2
Name:
Cyclin-dependent kinase 9
Synonyms:
C-2K CDK9 Cell division cycle 2-like protein kinase 4 Cyclin-Dependent Kinase 9 (CDK9) Serine/threonine-protein kinase PITALRE Tat-associated kinase complex catalytic subunit
Type:
Enzyme Subunit
Mol. Mass.:
42789.13
Organism:
Homo sapiens (Human)
Description:
Residue:
372
  
Inhibitor
Name:
BDBM50367682
Synonyms:
CHEMBL4162128
Type:
Small organic molecule
Emp. Form.:
C16H20BrN5O6
Mol. Mass.:
458.264
SMILES:
CC(C)C(=O)OC[C@@H]1O[C@H]([C@@H](O)[C@@H]1O)n1cnc(N)c2c(C(N)=O)c(Br)nc12
: