Target
Cyclin-dependent kinase 12
Ligand
BDBM50367956
Substrate
Meas. Tech.
ChEMBL_1735959 (CHEMBL4151495)
IC50
8600±n/a nM
Citation
 Ito, MTanaka, TToita, AUchiyama, NKokubo, HMorishita, NKlein, MGZou, HMurakami, MKondo, MSameshima, TAraki, SEndo, SKawamoto, TMorin, GBAparicio, SANakanishi, AMaezaki, HImaeda, Y Discovery of 3-Benzyl-1-( trans-4-((5-cyanopyridin-2-yl)amino)cyclohexyl)-1-arylurea Derivatives as Novel and Selective Cyclin-Dependent Kinase 12 (CDK12) Inhibitors. J Med Chem 61:7710-7728 (2018)  
Target
Name:
Cyclin-dependent kinase 12
Synonyms:
2.7.11.22 CDC2-related protein kinase 7 CDK12_HUMAN CRKRS Cell division cycle 2-related protein kinase 7 Cyclin-dependent kinase 12 hCDK12
Type:
PROTEIN
Mol. Mass.:
164218.64
Organism:
Homo sapiens
Description:
ChEMBL_117739
Residue:
1490
  
Inhibitor
Name:
BDBM50367956
Synonyms:
CHEMBL4164065
Type:
Small organic molecule
Emp. Form.:
C22H24N6
Mol. Mass.:
372.4662
SMILES:
Cn1cc(cn1)-c1ccc(N[C@H]2CC[C@@H](CC2)Nc2ccc(cn2)C#N)cc1
: