Target
Broad substrate specificity ATP-binding cassette transporter ABCG2
Ligand
BDBM50368325
Substrate
Meas. Tech.
ChEMBL_1736046 (CHEMBL4151582)
IC50
65±n/a nM
Citation
 Krapf, MKGallus, JNamasivayam, VWiese, M 2,4,6-Substituted Quinazolines with Extraordinary Inhibitory Potency toward ABCG2. J Med Chem 61:7952-7976 (2018)  
Target
Name:
Broad substrate specificity ATP-binding cassette transporter ABCG2
Synonyms:
ABCG2 ABCP ATP-binding cassette sub-family G member 2 ATP-binding cassette, sub-family G, member 2 BCRP1 CDw338 Mitoxantrone resistance-associated protein Urate exporter
Type:
Multi-pass membrane protein; monomer or homodimer; disulfide-linked
Mol. Mass.:
72329.48
Organism:
Homo sapiens (Human)
Description:
Q9UNQ0
Residue:
655
  
Inhibitor
Name:
BDBM50368325
Synonyms:
CHEMBL4170623
Type:
Small organic molecule
Emp. Form.:
C20H14N4O3
Mol. Mass.:
358.3502
SMILES:
Oc1cccc(Nc2nc(nc3ccc(cc23)[N+]([O-])=O)-c2ccccc2)c1
: