Target
Broad substrate specificity ATP-binding cassette transporter ABCG2
Ligand
BDBM50368396
Substrate
Meas. Tech.
ChEMBL_1736052 (CHEMBL4151588)
EC50
71±n/a nM
Citation
 Krapf, MKGallus, JNamasivayam, VWiese, M 2,4,6-Substituted Quinazolines with Extraordinary Inhibitory Potency toward ABCG2. J Med Chem 61:7952-7976 (2018)  
Target
Name:
Broad substrate specificity ATP-binding cassette transporter ABCG2
Synonyms:
ABCG2 ABCP ATP-binding cassette sub-family G member 2 ATP-binding cassette, sub-family G, member 2 BCRP1 CDw338 Mitoxantrone resistance-associated protein Urate exporter
Type:
Multi-pass membrane protein; monomer or homodimer; disulfide-linked
Mol. Mass.:
72329.48
Organism:
Homo sapiens (Human)
Description:
Q9UNQ0
Residue:
655
  
Inhibitor
Name:
BDBM50368396
Synonyms:
CHEMBL4164155
Type:
Small organic molecule
Emp. Form.:
C20H15N5O3
Mol. Mass.:
373.3648
SMILES:
COc1ccc(Nc2nc(nc3ccc(cc23)[N+]([O-])=O)-c2ccncc2)cc1
: