Target
Neuronal acetylcholine receptor subunit alpha-4/beta-2
Ligand
BDBM50406804
Substrate
Meas. Tech.
ChEMBL_1738898 (CHEMBL4154648)
Ki
0.950000±n/a nM
Citation
 Deligia, FMurineddu, GGotti, CRagusa, GFasoli, FSciaccaluga, MPlutino, SFucile, SLoriga, GAsproni, BPinna, GA Pyridinyl- and pyridazinyl-3,6-diazabicyclo[3.1.1]heptane-anilines: Novel selective ligands with subnanomolar affinity for ? Eur J Med Chem 152:401-416 (2018)  
Target
Name:
Neuronal acetylcholine receptor subunit alpha-4/beta-2
Synonyms:
Neuronal acetylcholine receptor Alpha-4/Beta-2 Neuronal acetylcholine receptor; alpha4/beta2 | nAChR subtypes alpha4 beta2
Type:
Protein
Mol. Mass.:
Description:
Components:
This complex has 2 components.
Component 1
Name:
Neuronal acetylcholine receptor subunit alpha-4
Synonyms:
ACHA4_HUMAN CHRNA4 protein Neuronal acetylcholine receptor protein alpha-4 subunit Nicotinic acetylcholine receptor alpha4/beta2/alpha5
Type:
Mol. Mass.:
69963.49
Organism:
Homo sapiens (Human)
Description:
NACHRA4
Residue:
627
  
Component 2
Name:
Neuronal acetylcholine receptor subunit beta-2
Synonyms:
ACHB2_HUMAN Neuronal acetylcholine receptor protein beta-2 subunit | Nicotinic acetylcholine receptor alpha3/beta2/alpha5
Type:
Protein
Mol. Mass.:
57020.50
Organism:
Homo sapiens (Human)
Description:
P17787
Residue:
502
  
Inhibitor
Name:
BDBM50406804
Synonyms:
CHEMBL4177192
Type:
Small organic molecule
Emp. Form.:
C11H14ClN3
Mol. Mass.:
223.702
SMILES:
Clc1ccc(cn1)N1CC2CCC(C1)N2
: