Target
Carbonic anhydrase 6
Ligand
BDBM50449811
Substrate
Meas. Tech.
ChEMBL_1740764 (CHEMBL4156514)
Kd
3.5±n/a nM
Citation
 Zak?auskas, A?apkauskait?, EJezep?ikas, LLinkuvien?, VKi?onait?, MSmirnov, AManakova, EGra?ulis, SMatulis, D Design of two-tail compounds with rotationally fixed benzenesulfonamide ring as inhibitors of carbonic anhydrases. Eur J Med Chem 156:61-78 (2018)  
Target
Name:
Carbonic anhydrase 6
Synonyms:
CA-VI CAH6_HUMAN Carbonic Anhydrase VI Carbonic anhydrase 6 Carbonic anhydrase 6 (CA-VI) Salivary carbonic anhydrase | Secreted carbonic anhydrase
Type:
Enzyme
Mol. Mass.:
35371.40
Organism:
Homo sapiens (Human)
Description:
P23280
Residue:
308
  
Inhibitor
Name:
BDBM50449811
Synonyms:
CHEMBL4165127
Type:
Small organic molecule
Emp. Form.:
C7H5Br2NO4S
Mol. Mass.:
358.992
SMILES:
NS(=O)(=O)c1cc(C(O)=O)c(Br)cc1Br
: