Target
Carbonic anhydrase 6
Ligand
BDBM50449812
Substrate
Meas. Tech.
ChEMBL_1740764 (CHEMBL4156514)
Kd
6.0±n/a nM
Citation
 Zak?auskas, A?apkauskait?, EJezep?ikas, LLinkuvien?, VKi?onait?, MSmirnov, AManakova, EGra?ulis, SMatulis, D Design of two-tail compounds with rotationally fixed benzenesulfonamide ring as inhibitors of carbonic anhydrases. Eur J Med Chem 156:61-78 (2018)  
Target
Name:
Carbonic anhydrase 6
Synonyms:
CA-VI CAH6_HUMAN Carbonic Anhydrase VI Carbonic anhydrase 6 Carbonic anhydrase 6 (CA-VI) Salivary carbonic anhydrase | Secreted carbonic anhydrase
Type:
Enzyme
Mol. Mass.:
35371.40
Organism:
Homo sapiens (Human)
Description:
P23280
Residue:
308
  
Inhibitor
Name:
BDBM50449812
Synonyms:
CHEMBL4176828
Type:
Small organic molecule
Emp. Form.:
C15H22ClN3O4S
Mol. Mass.:
375.871
SMILES:
NS(=O)(=O)c1cc(C(=O)NCCO)c(NC2CCCCC2)cc1Cl
: