Target
Thiosulfate sulfurtransferase
Ligand
BDBM50450004
Substrate
Meas. Tech.
ChEMBL_1741629 (CHEMBL4157379)
IC50
>100000±n/a nM
Citation
 Abdeen, SKunkle, TSalim, NRay, AMMammadova, NSummers, CStevens, MAmbrose, AJPark, YSchultz, PGHorwich, ALHoang, QQChapman, EJohnson, SM Sulfonamido-2-arylbenzoxazole GroEL/ES Inhibitors as Potent Antibacterials against Methicillin-Resistant Staphylococcus aureus (MRSA). J Med Chem 61:7345-7357 (2018)  
Target
Name:
Thiosulfate sulfurtransferase
Synonyms:
2.8.1.1 THTR_HUMAN Thiosulfate sulfurtransferase
Type:
PROTEIN
Mol. Mass.:
33432.06
Organism:
Homo sapiens
Description:
ChEMBL_118080
Residue:
297
  
Inhibitor
Name:
BDBM50450004
Synonyms:
CHEMBL4160098
Type:
Small organic molecule
Emp. Form.:
C24H15ClF3N3O5S3
Mol. Mass.:
614.036
SMILES:
FC(F)(F)c1cccc(c1)S(=O)(=O)Nc1ccc(cc1)-c1nc2cc(NS(=O)(=O)c3ccc(Cl)s3)ccc2o1
: