Target
60 kDa heat shock protein, mitochondrial
Ligand
BDBM50450001
Substrate
Meas. Tech.
ChEMBL_1741628 (CHEMBL4157378)
IC50
5900±n/a nM
Citation
 Abdeen, SKunkle, TSalim, NRay, AMMammadova, NSummers, CStevens, MAmbrose, AJPark, YSchultz, PGHorwich, ALHoang, QQChapman, EJohnson, SM Sulfonamido-2-arylbenzoxazole GroEL/ES Inhibitors as Potent Antibacterials against Methicillin-Resistant Staphylococcus aureus (MRSA). J Med Chem 61:7345-7357 (2018)  
Target
Name:
60 kDa heat shock protein, mitochondrial
Synonyms:
3.6.4.9 60 kDa heat shock protein, mitochondrial CPN60 HSP-60 HSP60/HSP10 Heat shock protein 60 Mitochondrial matrix protein P1 | P60 lymphocyte protein
Type:
PROTEIN
Mol. Mass.:
61050.41
Organism:
Homo sapiens
Description:
ChEMBL_117701
Residue:
573
  
Inhibitor
Name:
BDBM50450001
Synonyms:
CHEMBL4162794
Type:
Small organic molecule
Emp. Form.:
C21H13Cl2N3O5S4
Mol. Mass.:
586.511
SMILES:
Clc1ccc(s1)S(=O)(=O)Nc1ccc(cc1)-c1nc2cc(NS(=O)(=O)c3ccc(Cl)s3)ccc2o1
: