Target
Lanosterol synthase
Ligand
BDBM50450465
Substrate
Meas. Tech.
ChEMBL_1742587 (CHEMBL4158337)
IC50
501±n/a nM
Citation
 Buchler, IAkuma, DAu, VCarr, Gde León, PDePasquale, MErnst, GHuang, YKimos, MKolobova, APoslusney, MWei, HSwinnen, DMontel, FMoureau, FJigorel, ESchulze, MEDWood, MBarrow, JC Optimization of 8-Hydroxyquinolines as Inhibitors of Catechol O-Methyltransferase. J Med Chem 61:9647-9665 (2018)  
Target
Name:
Lanosterol synthase
Synonyms:
LSS_RAT Osc
Type:
PROTEIN
Mol. Mass.:
83302.12
Organism:
Rattus norvegicus
Description:
ChEMBL_12083
Residue:
733
  
Inhibitor
Name:
BDBM50450465
Synonyms:
CHEMBL4177089
Type:
Small organic molecule
Emp. Form.:
C16H12FNO3S
Mol. Mass.:
317.335
SMILES:
Cc1ccc(cc1)S(=O)(=O)c1cc(F)c(O)c2ncccc12
: