Target
Lanosterol synthase
Ligand
BDBM50437328
Substrate
Meas. Tech.
ChEMBL_1742619 (CHEMBL4158369)
IC50
6310±n/a nM
Citation
 Buchler, IAkuma, DAu, VCarr, Gde León, PDePasquale, MErnst, GHuang, YKimos, MKolobova, APoslusney, MWei, HSwinnen, DMontel, FMoureau, FJigorel, ESchulze, MEDWood, MBarrow, JC Optimization of 8-Hydroxyquinolines as Inhibitors of Catechol O-Methyltransferase. J Med Chem 61:9647-9665 (2018)  
Target
Name:
Lanosterol synthase
Synonyms:
LSS_RAT Osc
Type:
PROTEIN
Mol. Mass.:
83302.12
Organism:
Rattus norvegicus
Description:
ChEMBL_12083
Residue:
733
  
Inhibitor
Name:
BDBM50437328
Synonyms:
CHEMBL2407598
Type:
Small organic molecule
Emp. Form.:
C9H7NO4S
Mol. Mass.:
225.221
SMILES:
Oc1ccc(c2cccnc12)S(O)(=O)=O
: