Target
Neuropeptide Y receptor type 2
Ligand
BDBM50450993
Substrate
Meas. Tech.
ChEMBL_1744522 (CHEMBL4179032)
IC50
0.310000±n/a nM
Citation
 Nishizawa, NNiida, AAdachi, YKanematsu-Yamaki, YMasuda, YKumano, SYokoyama, KNoguchi, YAsakawa, THirabayashi, HAmano, NTakekawa, SOhtaki, TAsami, T Highly potent antiobesity effect of a short-length peptide YY analog in mice. Bioorg Med Chem 25:5718-5725 (2017)  
Target
Name:
Neuropeptide Y receptor type 2
Synonyms:
NPY-Y2 NPY2-R NPY2R_HUMAN Y2 receptor | neuropeptide Y receptor Y2
Type:
Enzyme Catalytic Domain
Mol. Mass.:
42734.65
Organism:
Homo sapiens (Human)
Description:
NPY-Y2 NPY2R HUMAN::P49146
Residue:
381
  
Inhibitor
Name:
BDBM50450993
Synonyms:
CHEMBL4210786
Type:
Small organic molecule
Emp. Form.:
C85H141N27O20
Mol. Mass.:
1861.1979
SMILES:
CC[C@](C)(NC(=O)[C@H]1C[C@H](O)CN1C(=O)[C@H](CO)NC(=O)c1c[nH]cn1)C(=O)N[C@@H](Cc1ccncc1)C(=O)N[C@@H](CC1CCCCC1)C(=O)N[C@@H](CC(C)(C)C)C(=O)N[C@@H](CC(N)=O)C(=O)N[C@@H](CCCCN)C(=O)NC(C)(C)C(=O)N[C@@H]([C@@H](C)O)C(=O)N[C@@H](CCCNC(N)=N)C(=O)N[C@@H](CCC(N)=O)C(=O)N[C@@H](CCCNC(N)=N)C(=O)N[C@@H](CC1CCCCC1)C(N)=O
: